Livecoding Build Error on Mac: clang: error: ld.lld


OsciStudio Version: 6.0.38
Operating System: macOS Mojave 10.14.6

Tried to load up a Livecoding device on a track with a built-in test cube.
I got this error - looks like something is wrong in my configuration? Do I need to re-install?
FYI I don’t have this problem when I test on the same release for Windows:

usage: dirname path
/Applications/OsciStudio_0.6.0.38_pre2_osx/OsciStudio line 15: /ld: No such file or directory
clang: error: unable to execute command: No such file or directory
clang: error: linker command failed due to signal (use -v to see invocation)

Please fix your build errors!



can you ost the full error?